Reaction Details
TargetNociceptin receptor
LigandBDBM50094652
Substrate/Competitorn/a
Meas. Tech.ChEMBL_146120 (CHEMBL754589)
Ki 89±n/a nM
Citation Shinkai, HIto, TIida, TKitao, YYamada, HUchida, I 4-Aminoquinolines: novel nociceptin antagonists with analgesic activity. J Med Chem43:4667-77 (2001) Nociceptin receptor
Name:Nociceptin receptor
Type:G Protein-Coupled Receptor (GPCR)
Mol. Mass.:40702.87
Organism:Homo sapiens (Human)
Description:P41146
Residue:370
BDBM50094652
NameBDBM50094652
Synonyms:CHEMBL343424 | N-(4-Amino-2-methyl-quinolin-6-yl)-2-(2-p-tolyl-ethyl)-benzamide
TypeSmall organic molecule
Emp. Form.C26H25N3O
Mol. Mass.395.4962
SMILESCc1ccc(CCc2ccccc2C(=O)Nc2ccc3nc(C)cc(N)c3c2)cc1