Reaction Details
TargetNociceptin receptor
LigandBDBM50094653
Substrate/Competitorn/a
Meas. Tech.ChEMBL_146120 (CHEMBL754589)
Ki 121±n/a nM
Citation Shinkai, HIto, TIida, TKitao, YYamada, HUchida, I 4-Aminoquinolines: novel nociceptin antagonists with analgesic activity. J Med Chem43:4667-77 (2001) Nociceptin receptor
Name:Nociceptin receptor
Type:G Protein-Coupled Receptor (GPCR)
Mol. Mass.:40702.87
Organism:Homo sapiens (Human)
Description:P41146
Residue:370
BDBM50094653
NameBDBM50094653
Synonyms:CHEMBL141078 | N-(4-Amino-2-methyl-quinolin-6-yl)-2-(3-phenyl-propyl)-benzamide
TypeSmall organic molecule
Emp. Form.C26H25N3O
Mol. Mass.395.4962
SMILESCc1cc(N)c2cc(NC(=O)c3ccccc3CCCc3ccccc3)ccc2n1