Reaction Details
Target5-hydroxytryptamine receptor 1A
LigandBDBM50094670
Substrate/Competitorn/a
Meas. Tech.ChEMBL_1426 (CHEMBL616506)
Ki 0.088±n/a nM
Citation Blair, JBKurrasch-Orbaugh, DMarona-Lewicka, DCumbay, MGWatts, VJBarker, ELNichols, DE Effect of ring fluorination on the pharmacology of hallucinogenic tryptamines. J Med Chem43:4701-10 (2001) 5-hydroxytryptamine receptor 1A
Name:5-hydroxytryptamine receptor 1A
Type:G Protein-Coupled Receptor (GPCR)
Mol. Mass.:46445.29
Organism:Rattus norvegicus (rat)
Description:Binding assays were performed using rat hippocampal membranes.
Residue:422
BDBM50094670
NameBDBM50094670
Synonyms:1-(4-Dipropylamino-1,3,4,5-tetrahydro-benzo[cd]indol-6-yl)-ethanone LY 293284 LY-293384
TypeSmall organic molecule
Emp. Form.C19H26N2O
Mol. Mass.298.4225
SMILESCCCN(CCC)C1Cc2c[nH]c3ccc(C(C)=O)c(C1)c23