Reaction Details
TargetAdenosine receptor A3
LigandBDBM50094696
Substrate/Competitorn/a
Meas. Tech.ChEMBL_29905 (CHEMBL641976)
Ki 0.14±n/a nM
Citation Baraldi, PGCacciari, BRomagnoli, RSpalluto, GMoro, SKlotz, KNLeung, EVarani, KGessi, SMerighi, SBorea, PA Pyrazolo[4,3-e]1,2,4-triazolo[1,5-c]pyrimidine derivatives as highly potent and selective human A(3) adenosine receptor antagonists: influence of the chain at the N(8) pyrazole nitrogen. J Med Chem43:4768-80 (2000) Adenosine receptor A3
Name:Adenosine receptor A3
Type:G Protein-Coupled Receptor (GPCR)
Mol. Mass.:36197.32
Organism:Homo sapiens (Human)
Description:P0DMS8
Residue:318
BDBM50094696
NameBDBM50094696
Synonyms:1-(2-(furan-2-yl)-8H-pyrazolo[4,3-e][1,2,4]triazolo[1,5-c]pyrimidin-5-yl)-3-(4-methoxyphenyl)urea CHEMBL145767
TypeSmall organic molecule
Emp. Form.C18H14N8O3
Mol. Mass.390.3556
SMILESCOc1ccc(NC(=O)Nc2nc3n[nH]cc3c3nc(nn23)-c2ccco2)cc1