Reaction Details
TargetAdenosine receptor A3
LigandBDBM85619
Substrate/Competitorn/a
Meas. Tech.ChEMBL_30035 (CHEMBL640378)
Ki 0.9±n/a nM
Citation Baraldi, PGCacciari, BRomagnoli, RSpalluto, GMoro, SKlotz, KNLeung, EVarani, KGessi, SMerighi, SBorea, PA Pyrazolo[4,3-e]1,2,4-triazolo[1,5-c]pyrimidine derivatives as highly potent and selective human A(3) adenosine receptor antagonists: influence of the chain at the N(8) pyrazole nitrogen. J Med Chem43:4768-80 (2000) Adenosine receptor A3
Name:Adenosine receptor A3
Type:G Protein-Coupled Receptor (GPCR)
Mol. Mass.:36197.32
Organism:Homo sapiens (Human)
Description:P0DMS8
Residue:318
BDBM85619
NameBDBM85619
Synonyms:1-(3-chlorophenyl)-3-[2-(furan-2-yl)-8-propyl-8H-pyrazolo[4,3-e][1,2,4]triazolo[1,5-c]pyrimidin-5-yl]urea MRE 3010F20
TypeSmall organic molecule
Emp. Form.C20H17ClN8O2
Mol. Mass.436.854
SMILESCCCn1cc2c(n1)nc(NC(=O)Nc1cccc(Cl)c1)n1nc(nc21)-c1ccco1