Reaction Details
TargetMetabotropic glutamate receptor 2
LigandBDBM50094841
Substrate/Competitorn/a
Meas. Tech.ChEMBL_106215 (CHEMBL713203)
Ki 47.7±n/a nM
Citation Nakazato, AKumagai, TSakagami, KYoshikawa, RSuzuki, YChaki, SIto, HTaguchi, TNakanishi, SOkuyama, S Synthesis, SARs, and pharmacological characterization of 2-amino-3 or 6-fluorobicyclo[3.1.0]hexane-2,6-dicarboxylic acid derivatives as potent, selective, and orally active group II metabotropic glutamate receptor agonists. J Med Chem43:4893-909 (2000) Metabotropic glutamate receptor 2
Name:Metabotropic glutamate receptor 2
Type:Enzyme
Mol. Mass.:95584.88
Organism:Homo sapiens (Human)
Description:Q14416
Residue:872
BDBM50094841
NameBDBM50094841
Synonyms:(+)-2-Amino-3-fluoro-bicyclo[3.1.0]hexane-2,6-dicarboxylic acid (1S,2S,3S,5R,6S)-2-amino-3-fluorobicyclo[3.1.0]hexane-2,6-dicarboxylic acid CHEMBL334014
TypeSmall organic molecule
Emp. Form.C8H10FNO4
Mol. Mass.203.1677
SMILESN[C@@]1([C@H]2[C@@H](C[C@@H]1F)[C@@H]2C(O)=O)C(O)=O