Reaction Details
TargetMetabotropic glutamate receptor 2
LigandBDBM50056272
Substrate/Competitorn/a
Meas. Tech.ChEMBL_106215 (CHEMBL713203)
Ki 23.4±n/a nM
Citation Nakazato, AKumagai, TSakagami, KYoshikawa, RSuzuki, YChaki, SIto, HTaguchi, TNakanishi, SOkuyama, S Synthesis, SARs, and pharmacological characterization of 2-amino-3 or 6-fluorobicyclo[3.1.0]hexane-2,6-dicarboxylic acid derivatives as potent, selective, and orally active group II metabotropic glutamate receptor agonists. J Med Chem43:4893-909 (2000) Metabotropic glutamate receptor 2
Name:Metabotropic glutamate receptor 2
Type:Enzyme
Mol. Mass.:95584.88
Organism:Homo sapiens (Human)
Description:Q14416
Residue:872
BDBM50056272
NameBDBM50056272
Synonyms:(1S,2S,5R,6S)-2-Amino-bicyclo[3.1.0]hexane-2,6-dicarboxylic acid (2S,6S)-2-Amino-bicyclo[3.1.0]hexane-2,6-dicarboxylic acid 2-Amino-bicyclo[3.1.0]hexane-2,6-dicarboxylic acid (LY 354740) CHEMBL8759 LY366563
TypeSmall organic molecule
Emp. Form.C8H11NO4
Mol. Mass.185.1772
SMILESN[C@]1(CC[C@H]2[C@@H]([C@@H]12)C(O)=O)C(O)=O