Reaction Details
TargetMetabotropic glutamate receptor 2
LigandBDBM50094843
Substrate/Competitorn/a
Meas. Tech.ChEMBL_106057 (CHEMBL718223)
EC50 0.57±n/a nM
Citation Nakazato, AKumagai, TSakagami, KYoshikawa, RSuzuki, YChaki, SIto, HTaguchi, TNakanishi, SOkuyama, S Synthesis, SARs, and pharmacological characterization of 2-amino-3 or 6-fluorobicyclo[3.1.0]hexane-2,6-dicarboxylic acid derivatives as potent, selective, and orally active group II metabotropic glutamate receptor agonists. J Med Chem43:4893-909 (2000) Metabotropic glutamate receptor 2
Name:Metabotropic glutamate receptor 2
Type:Enzyme
Mol. Mass.:95584.88
Organism:Homo sapiens (Human)
Description:Q14416
Residue:872
BDBM50094843
NameBDBM50094843
Synonyms:(+)-2-Amino-6-fluoro-4-oxo-bicyclo[3.1.0]hexane-2,6-dicarboxylic acid (-)-2-Amino-6-fluoro-4-oxo-bicyclo[3.1.0]hexane-2,6-dicarboxylic acid CHEMBL121053
TypeSmall organic molecule
Emp. Form.C8H8FNO5
Mol. Mass.217.1512
SMILESN[C@]1(CC(=O)[C@@H]2[C@H]1[C@@]2(F)C(O)=O)C(O)=O