Reaction Details
TargetPapain
LigandBDBM50094932
Substrate/Competitorn/a
Meas. Tech.ChEBML_152642
IC50 570.0±n/a nM
Citation Schirmeister, T (S)-Thiirancarboxylic acid as a reactive building block for a new class of cysteine protease inhibitors. Bioorg Med Chem Lett10:2647-51 (2000) Papain
Name:Papain
Type:Enzyme
Mol. Mass.:38923.01
Organism:Carica papaya
Description:Papain was purchased from Sigma, Germany.
Residue:345
BDBM50094932
NameBDBM50094932
Synonyms:(S)-Thiirane-2-carboxylic acid ethyl ester | CHEMBL88733
TypeSmall organic molecule
Emp. Form.C5H8O2S
Mol. Mass.132.181
SMILESCCOC(=O)[C@H]1CS1