Reaction Details
TargetProstaglandin G/H synthase 1
LigandBDBM22369
Substrate/Competitorn/a
Meas. Tech.ChEBML_51516
IC50 18800±n/a nM
Citation Nicoll-Griffith, DAYergey, JATrimble, LASilva, JMLi, CChauret, NGauthier, JYGrimm, ELéger, SRoy, PThérien, MWang, ZPrasit, PZamboni, RYoung, RNBrideau, CChan, CCMancini, JRiendeau, D Synthesis, characterization, and activity of metabolites derived from the cyclooxygenase-2 inhibitor rofecoxib (MK-0966, Vioxx). Bioorg Med Chem Lett10:2683-6 (2000) Prostaglandin G/H synthase 1
Name:Prostaglandin G/H synthase 1
Type:Enzyme
Mol. Mass.:68692.62
Organism:Homo sapiens (Human)
Description:P23219
Residue:599
BDBM22369
NameBDBM22369
Synonyms:4-(4-methanesulfonylphenyl)-3-phenyl-2,5-dihydrofuran-2-one MK 0966 US11478464, Compound Rofecoxib | US11786535, Compound Rofecoxib
TypeSmall organic molecule
Emp. Form.C17H14O4S
Mol. Mass.314.356
SMILESCS(=O)(=O)c1ccc(cc1)C1=C(C(=O)OC1)c1ccccc1