Reaction Details
Target5-hydroxytryptamine receptor 2A
LigandBDBM50095028
Substrate/Competitorn/a
Meas. Tech.ChEBML_2274
Ki 2.7±n/a nM
Citation Smith, ALStevenson, GILewis, SPatel, SCastro, JL Solid-phase synthesis of 2,3-disubstituted indoles: discovery of a novel, high-affinity, selective h5-HT2A antagonist. Bioorg Med Chem Lett10:2693-6 (2000) 5-hydroxytryptamine receptor 2A
Name:5-hydroxytryptamine receptor 2A
Type:undefined
Mol. Mass.:52607.65
Organism:Homo sapiens (Human)
Description:P28223
Residue:471
BDBM50095028
NameBDBM50095028
Synonyms:2-Phenyl-3-(2-piperidin-1-yl-ethyl)-1H-indole | CHEMBL91205
TypeSmall organic molecule
Emp. Form.C21H24N2
Mol. Mass.304.4287
SMILESC(Cc1c([nH]c2ccccc12)-c1ccccc1)N1CCCCC1