Reaction Details
TargetD(2) dopamine receptor
LigandBDBM50095034
Substrate/Competitorn/a
Meas. Tech.ChEBML_60046
Ki 0.420000±n/a nM
Citation Stevenson, GISmith, ALLewis, SMichie, SGNeduvelil, JGPatel, SMarwood, RPatel, SCastro, JL 2-Aryl tryptamines: selective high-affinity antagonists for the h5-HT2A receptor. Bioorg Med Chem Lett10:2697-9 (2000) D(2) dopamine receptor
Name:D(2) dopamine receptor
Type:Cell-surface receptors
Mol. Mass.:50647.10
Organism:Homo sapiens (Human)
Description:P14416
Residue:443
BDBM50095034
NameBDBM50095034
Synonyms:4-{3-[2-(Ethyl-methyl-amino)-ethyl]-1H-indol-2-yl}-benzonitrile | CHEMBL91542
TypeSmall organic molecule
Emp. Form.C20H21N3
Mol. Mass.303.4008
SMILESCCN(C)CCc1c([nH]c2ccccc12)-c1ccc(cc1)C#N