Reaction Details
Target5-hydroxytryptamine receptor 2C
LigandBDBM50095037
Substrate/Competitorn/a
Meas. Tech.ChEBML_2953
Ki 29±n/a nM
Citation Stevenson, GISmith, ALLewis, SMichie, SGNeduvelil, JGPatel, SMarwood, RPatel, SCastro, JL 2-Aryl tryptamines: selective high-affinity antagonists for the h5-HT2A receptor. Bioorg Med Chem Lett10:2697-9 (2000) 5-hydroxytryptamine receptor 2C
Name:5-hydroxytryptamine receptor 2C
Type:G Protein-Coupled Receptor (GPCR)
Mol. Mass.:51836.79
Organism:Homo sapiens (Human)
Description:P28335
Residue:458
BDBM50095037
NameBDBM50095037
Synonyms:3-[2-((S)-2-Methoxymethyl-pyrrolidin-1-yl)-ethyl]-2-phenyl-1H-indole | CHEMBL91446
TypeSmall organic molecule
Emp. Form.C22H26N2O
Mol. Mass.334.4546
SMILESCOC[C@@H]1CCCN1CCc1c([nH]c2ccccc12)-c1ccccc1