Reaction Details
Target5-hydroxytryptamine receptor 2A
LigandBDBM50095029
Substrate/Competitorn/a
Meas. Tech.ChEBML_2275
Ki 4.4±n/a nM
Citation Stevenson, GISmith, ALLewis, SMichie, SGNeduvelil, JGPatel, SMarwood, RPatel, SCastro, JL 2-Aryl tryptamines: selective high-affinity antagonists for the h5-HT2A receptor. Bioorg Med Chem Lett10:2697-9 (2000) 5-hydroxytryptamine receptor 2A
Name:5-hydroxytryptamine receptor 2A
Type:undefined
Mol. Mass.:52607.65
Organism:Homo sapiens (Human)
Description:P28223
Residue:471
BDBM50095029
NameBDBM50095029
Synonyms:CHEMBL91447 | Dimethyl-[2-(2-phenyl-1H-indol-3-yl)-ethyl]-amine
TypeSmall organic molecule
Emp. Form.C18H20N2
Mol. Mass.264.3648
SMILESCN(C)CCc1c([nH]c2ccccc12)-c1ccccc1