Reaction Details
Target5-hydroxytryptamine receptor 2A
LigandBDBM50095040
Substrate/Competitorn/a
Meas. Tech.ChEBML_2275
Ki 2.8±n/a nM
Citation Stevenson, GISmith, ALLewis, SMichie, SGNeduvelil, JGPatel, SMarwood, RPatel, SCastro, JL 2-Aryl tryptamines: selective high-affinity antagonists for the h5-HT2A receptor. Bioorg Med Chem Lett10:2697-9 (2000) 5-hydroxytryptamine receptor 2A
Name:5-hydroxytryptamine receptor 2A
Type:undefined
Mol. Mass.:52607.65
Organism:Homo sapiens (Human)
Description:P28223
Residue:471
BDBM50095040
NameBDBM50095040
Synonyms:CHEMBL328257 | Diethyl-[2-(2-phenyl-1H-indol-3-yl)-ethyl]-amine
TypeSmall organic molecule
Emp. Form.C20H24N2
Mol. Mass.292.418
SMILESCCN(CC)CCc1c([nH]c2ccccc12)-c1ccccc1