Reaction Details
Target5-hydroxytryptamine receptor 2C
LigandBDBM50095042
Substrate/Competitorn/a
Meas. Tech.ChEBML_2953
Ki 36±n/a nM
Citation Stevenson, GISmith, ALLewis, SMichie, SGNeduvelil, JGPatel, SMarwood, RPatel, SCastro, JL 2-Aryl tryptamines: selective high-affinity antagonists for the h5-HT2A receptor. Bioorg Med Chem Lett10:2697-9 (2000) 5-hydroxytryptamine receptor 2C
Name:5-hydroxytryptamine receptor 2C
Type:G Protein-Coupled Receptor (GPCR)
Mol. Mass.:51836.79
Organism:Homo sapiens (Human)
Description:P28335
Residue:458
BDBM50095042
NameBDBM50095042
Synonyms:3-[2-((R)-2-Methyl-piperidin-1-yl)-ethyl]-2-phenyl-1H-indole | CHEMBL90263
TypeSmall organic molecule
Emp. Form.C22H26N2
Mol. Mass.318.4552
SMILESC[C@@H]1CCCCN1CCc1c([nH]c2ccccc12)-c1ccccc1