Reaction Details
TargetD(2) dopamine receptor
LigandBDBM50095037
Substrate/Competitorn/a
Meas. Tech.ChEBML_60046
Ki 92±n/a nM
Citation Stevenson, GISmith, ALLewis, SMichie, SGNeduvelil, JGPatel, SMarwood, RPatel, SCastro, JL 2-Aryl tryptamines: selective high-affinity antagonists for the h5-HT2A receptor. Bioorg Med Chem Lett10:2697-9 (2000) D(2) dopamine receptor
Name:D(2) dopamine receptor
Type:Cell-surface receptors
Mol. Mass.:50647.10
Organism:Homo sapiens (Human)
Description:P14416
Residue:443
BDBM50095037
NameBDBM50095037
Synonyms:3-[2-((S)-2-Methoxymethyl-pyrrolidin-1-yl)-ethyl]-2-phenyl-1H-indole | CHEMBL91446
TypeSmall organic molecule
Emp. Form.C22H26N2O
Mol. Mass.334.4546
SMILESCOC[C@@H]1CCCN1CCc1c([nH]c2ccccc12)-c1ccccc1