Reaction Details
TargetD(2) dopamine receptor
LigandBDBM50095043
Substrate/Competitorn/a
Meas. Tech.ChEBML_60046
Ki 17±n/a nM
Citation Stevenson, GISmith, ALLewis, SMichie, SGNeduvelil, JGPatel, SMarwood, RPatel, SCastro, JL 2-Aryl tryptamines: selective high-affinity antagonists for the h5-HT2A receptor. Bioorg Med Chem Lett10:2697-9 (2000) D(2) dopamine receptor
Name:D(2) dopamine receptor
Type:Cell-surface receptors
Mol. Mass.:50647.10
Organism:Homo sapiens (Human)
Description:P14416
Residue:443
BDBM50095043
NameBDBM50095043
Synonyms:CHEMBL90911 | Ethyl-methyl-{2-[2-(3-trifluoromethyl-phenyl)-1H-indol-3-yl]-ethyl}-amine
TypeSmall organic molecule
Emp. Form.C20H21F3N2
Mol. Mass.346.3893
SMILESCCN(C)CCc1c([nH]c2ccccc12)-c1cccc(c1)C(F)(F)F