Reaction Details
TargetD(2) dopamine receptor
LigandBDBM50095045
Substrate/Competitorn/a
Meas. Tech.ChEBML_60046
Ki 250±n/a nM
Citation Stevenson, GISmith, ALLewis, SMichie, SGNeduvelil, JGPatel, SMarwood, RPatel, SCastro, JL 2-Aryl tryptamines: selective high-affinity antagonists for the h5-HT2A receptor. Bioorg Med Chem Lett10:2697-9 (2000) D(2) dopamine receptor
Name:D(2) dopamine receptor
Type:Cell-surface receptors
Mol. Mass.:50647.10
Organism:Homo sapiens (Human)
Description:P14416
Residue:443
BDBM50095045
NameBDBM50095045
Synonyms:CHEMBL91463 | {2-[2-(4-Chloro-phenyl)-1H-indol-3-yl]-ethyl}-ethyl-methyl-amine
TypeSmall organic molecule
Emp. Form.C19H21ClN2
Mol. Mass.312.836
SMILESCCN(C)CCc1c([nH]c2ccccc12)-c1ccc(Cl)cc1