Reaction Details
Target5-hydroxytryptamine receptor 2A
LigandBDBM50095030
Substrate/Competitorn/a
Meas. Tech.ChEBML_2275
Ki 3000±n/a nM
Citation Stevenson, GISmith, ALLewis, SMichie, SGNeduvelil, JGPatel, SMarwood, RPatel, SCastro, JL 2-Aryl tryptamines: selective high-affinity antagonists for the h5-HT2A receptor. Bioorg Med Chem Lett10:2697-9 (2000) 5-hydroxytryptamine receptor 2A
Name:5-hydroxytryptamine receptor 2A
Type:undefined
Mol. Mass.:52607.65
Organism:Homo sapiens (Human)
Description:P28223
Residue:471
BDBM50095030
NameBDBM50095030
Synonyms:3-{2-[2-((R)-Methoxymethyl)-pyrrolidin-1-yl]-ethyl}-2-phenyl-1H-indole | CHEMBL91122
TypeSmall organic molecule
Emp. Form.C22H26N2O
Mol. Mass.334.4546
SMILESCOC[C@H]1CCCN1CCc1c([nH]c2ccccc12)-c1ccccc1