Reaction Details
Target5-hydroxytryptamine receptor 2A
LigandBDBM50095032
Substrate/Competitorn/a
Meas. Tech.ChEBML_2275
Ki 44±n/a nM
Citation Stevenson, GISmith, ALLewis, SMichie, SGNeduvelil, JGPatel, SMarwood, RPatel, SCastro, JL 2-Aryl tryptamines: selective high-affinity antagonists for the h5-HT2A receptor. Bioorg Med Chem Lett10:2697-9 (2000) 5-hydroxytryptamine receptor 2A
Name:5-hydroxytryptamine receptor 2A
Type:undefined
Mol. Mass.:52607.65
Organism:Homo sapiens (Human)
Description:P28223
Residue:471
BDBM50095032
NameBDBM50095032
Synonyms:3-(2-Azetidin-1-yl-ethyl)-2-phenyl-1H-indole | CHEMBL90092
TypeSmall organic molecule
Emp. Form.C19H20N2
Mol. Mass.276.3755
SMILESC(Cc1c([nH]c2ccccc12)-c1ccccc1)N1CCC1