Reaction Details
Target5-hydroxytryptamine receptor 2A
LigandBDBM50095046
Substrate/Competitorn/a
Meas. Tech.ChEBML_2275
Ki>1000±n/a nM
Citation Stevenson, GISmith, ALLewis, SMichie, SGNeduvelil, JGPatel, SMarwood, RPatel, SCastro, JL 2-Aryl tryptamines: selective high-affinity antagonists for the h5-HT2A receptor. Bioorg Med Chem Lett10:2697-9 (2000) 5-hydroxytryptamine receptor 2A
Name:5-hydroxytryptamine receptor 2A
Type:undefined
Mol. Mass.:52607.65
Organism:Homo sapiens (Human)
Description:P28223
Residue:471
BDBM50095046
NameBDBM50095046
Synonyms:CHEMBL92417 | Ethyl-[2-(2-furan-2-yl-1H-indol-3-yl)-ethyl]-methyl-amine
TypeSmall organic molecule
Emp. Form.C17H20N2O
Mol. Mass.268.3535
SMILESCCN(C)CCc1c([nH]c2ccccc12)-c1ccco1