Reaction Details
TargetD(2) dopamine receptor
LigandBDBM50095040
Substrate/Competitorn/a
Meas. Tech.ChEBML_60046
Ki>1000±n/a nM
Citation Stevenson, GISmith, ALLewis, SMichie, SGNeduvelil, JGPatel, SMarwood, RPatel, SCastro, JL 2-Aryl tryptamines: selective high-affinity antagonists for the h5-HT2A receptor. Bioorg Med Chem Lett10:2697-9 (2000) D(2) dopamine receptor
Name:D(2) dopamine receptor
Type:Cell-surface receptors
Mol. Mass.:50647.10
Organism:Homo sapiens (Human)
Description:P14416
Residue:443
BDBM50095040
NameBDBM50095040
Synonyms:CHEMBL328257 | Diethyl-[2-(2-phenyl-1H-indol-3-yl)-ethyl]-amine
TypeSmall organic molecule
Emp. Form.C20H24N2
Mol. Mass.292.418
SMILESCCN(CC)CCc1c([nH]c2ccccc12)-c1ccccc1