Reaction Details
Target5-hydroxytryptamine receptor 2A
LigandBDBM50095028
Substrate/Competitorn/a
Meas. Tech.ChEBML_2311
Ki 2.7±n/a nM
Citation Crawforth, JGoodacre, SMaxey, RBourrain, SPatel, SMarwood, RO'Connor, DHerbert, RHutson, PRowley, M 3-(4-Piperidinyl)- and 3-(8-aza-bicyclo[3.2.1]oct-3-yl)-2-phenyl-1H-indoles as bioavailable h5-HT2A antagonists. Bioorg Med Chem Lett10:2701-3 (2000) 5-hydroxytryptamine receptor 2A
Name:5-hydroxytryptamine receptor 2A
Type:undefined
Mol. Mass.:52607.65
Organism:Homo sapiens (Human)
Description:P28223
Residue:471
BDBM50095028
NameBDBM50095028
Synonyms:2-Phenyl-3-(2-piperidin-1-yl-ethyl)-1H-indole | CHEMBL91205
TypeSmall organic molecule
Emp. Form.C21H24N2
Mol. Mass.304.4287
SMILESC(Cc1c([nH]c2ccccc12)-c1ccccc1)N1CCCCC1