Reaction Details
TargetDual specificity mitogen-activated protein kinase kinase 1
LigandBDBM50095232
Substrate/Competitorn/a
Meas. Tech.ChEBML_100228
IC50 7±n/a nM
Citation Zhang, NWu, BPowell, DWissner, AFloyd, MBKovacs, EDToral-Barza, LKohler, C Synthesis and structure-activity relationships of 3-cyano-4-(phenoxyanilino)quinolines as MEK (MAPKK) inhibitors. Bioorg Med Chem Lett10:2825-8 (2000) Dual specificity mitogen-activated protein kinase kinase 1
Name:Dual specificity mitogen-activated protein kinase kinase 1
Type:Other Protein Type
Mol. Mass.:43439.03
Organism:Homo sapiens (Human)
Description:Full-length human MEK-1 was generated by PCR and purified as a fusion protein from Escherichia coli lysates.
Residue:393
BDBM50095232
NameBDBM50095232
Synonyms:6-Methoxy-7-(3-morpholin-4-yl-propoxy)-4-(4-phenoxy-phenylamino)-quinoline-3-carbonitrile | CHEMBL414139
TypeSmall organic molecule
Emp. Form.C30H30N4O4
Mol. Mass.510.5836
SMILESCOc1cc2c(Nc3ccc(Oc4ccccc4)cc3)c(cnc2cc1OCCCN1CCOCC1)C#N