Reaction Details
TargetDual specificity mitogen-activated protein kinase kinase 1/RAF proto-oncogene serine/threonine-protein kinase
LigandBDBM50095232
Substrate/Competitorn/a
Meas. Tech.ChEMBL_100226 (CHEMBL710955)
IC50 2.4±n/a nM
Citation Zhang, NWu, BPowell, DWissner, AFloyd, MBKovacs, EDToral-Barza, LKohler, C Synthesis and structure-activity relationships of 3-cyano-4-(phenoxyanilino)quinolines as MEK (MAPKK) inhibitors. Bioorg Med Chem Lett10:2825-8 (2000) Dual specificity mitogen-activated protein kinase kinase 1/RAF proto-oncogene serine/threonine-protein kinase
Name:Dual specificity mitogen-activated protein kinase kinase 1/RAF proto-oncogene serine/threonine-protein kinase
Synonyms:Serine/threonine-protein kinase RAF and Dual specificity mitogen-activated protein kinase kinase 1 (Raf/MEK)
Type:n/a
Mol. Mass.:n/a
Description:ASSAY_ID of ChEMBL is 100226
Components:This complex has 2 components.
Component 1
Name:RAF proto-oncogene serine/threonine-protein kinase
Type:Serine/threonine-protein kinase
Mol. Mass.:73082.52
Organism:Homo sapiens (Human)
Description:P04049
Residue:648
Component 2
Name:Dual specificity mitogen-activated protein kinase kinase 1
Synonyms:Dual specificity mitogen-activated protein kinase (MEK) Dual specificity mitogen-activated protein kinase kinase 1 (MEK1) Dual specificity mitogen-activated protein kinase kinase MEK1/2 MAP kinase kinase 1 MAPK/ERK kinase 1 MEK-1 MP2K1_HUMAN PRKMK1 | VHL-MAP2K1/MAP2K2
Type:Other Protein Type
Mol. Mass.:43439.03
Organism:Homo sapiens (Human)
Description:Full-length human MEK-1 was generated by PCR and purified as a fusion protein from Escherichia coli lysates.
Residue:393
BDBM50095232
NameBDBM50095232
Synonyms:6-Methoxy-7-(3-morpholin-4-yl-propoxy)-4-(4-phenoxy-phenylamino)-quinoline-3-carbonitrile | CHEMBL414139
TypeSmall organic molecule
Emp. Form.C30H30N4O4
Mol. Mass.510.5836
SMILESCOc1cc2c(Nc3ccc(Oc4ccccc4)cc3)c(cnc2cc1OCCCN1CCOCC1)C#N