Reaction Details
TargetATP-dependent translocase ABCB1
LigandBDBM50095338
Substrate/Competitorn/a
Meas. Tech.ChEBML_147988
Kd 2000±n/a nM
Citation Boumendjel, ABois, FBeney, CMariotte, AMConseil, GDi Pietro, A B-ring substituted 5,7-dihydroxyflavonols with high-affinity binding to P-glycoprotein responsible for cell multidrug resistance. Bioorg Med Chem Lett11:75-7 (2001) ATP-dependent translocase ABCB1
Name:ATP-dependent translocase ABCB1
Type:Protein
Mol. Mass.:140669.02
Organism:Mus musculus (Mouse)
Description:P21447
Residue:1276
BDBM50095338
NameBDBM50095338
Synonyms:2-(4-Benzhydryl-phenyl)-3,5,7-trihydroxy-chromen-4-one | CHEMBL164555
TypeSmall organic molecule
Emp. Form.C28H20O5
Mol. Mass.436.4554
SMILESOc1cc2oc(-c3ccc(cc3)C(c3ccccc3)c3ccccc3)c(O)c(O)c2c(=O)c1