Reaction Details
TargetAdenosine kinase
LigandBDBM50094703
Substrate/Competitorn/a
Meas. Tech.ChEMBL_31129 (CHEMBL643557)
IC50 50±n/a nM
Citation Cowart, MLee, CHGfesser, GABayburt, EKBhagwat, SSStewart, AOYu, HKohlhaas, KLMcGaraughty, SWismer, CTMikusa, JZhu, CAlexander, KMJarvis, MFKowaluk, EA Structure-activity studies of 5-substituted pyridopyrimidines as adenosine kinase inhibitors. Bioorg Med Chem Lett11:83-6 (2001) Adenosine kinase
Name:Adenosine kinase
Type:Enzyme
Mol. Mass.:40130.14
Organism:Rattus norvegicus (rat)
Description:Rat brain cytosol as enzyme source.
Residue:361
BDBM50094703
NameBDBM50094703
Synonyms:5-(3-Bromo-phenyl)-7-(6-morpholin-4-yl-pyridin-3-yl)-pyrido[2,3-d]pyrimidin-4-ylamine ABT-702 | CHEMBL66089
TypeSmall organic molecule
Emp. Form.C22H19BrN6O
Mol. Mass.463.33
SMILESNc1ncnc2nc(cc(-c3cccc(Br)c3)c12)-c1ccc(nc1)N1CCOCC1