Reaction Details
TargetCathepsin K
LigandBDBM50095491
Substrate/Competitorn/a
Meas. Tech.ChEMBL_48324 (CHEMBL663314)
Ki 140±n/a nM
Citation Falgueyret, JPOballa, RMOkamoto, OWesolowski, GAubin, YRydzewski, RMPrasit, PRiendeau, DRodan, SBPercival, MD Novel, nonpeptidic cyanamides as potent and reversible inhibitors of human cathepsins K and L. J Med Chem44:94-104 (2001) Cathepsin K
Name:Cathepsin K
Type:Enzyme
Mol. Mass.:36975.68
Organism:Homo sapiens (Human)
Description:P43235
Residue:329
BDBM50095491
NameBDBM50095491
Synonyms:(1-Cyano-pyrrolidin-3-yl)-carbamic acid benzyl ester | CHEMBL273229
TypeSmall organic molecule
Emp. Form.C13H15N3O2
Mol. Mass.245.2771
SMILESO=C(NC1CCN(C1)C#N)OCc1ccccc1