Reaction Details
TargetNeutrophil elastase
LigandBDBM50095518
Substrate/Competitorn/a
Meas. Tech.ChEMBL_88197 (CHEMBL699807)
Ki 44.3±n/a nM
Citation Ohmoto, KYamamoto, THoriuchi, TImanishi, HOdagaki, YKawabata, KSekioka, THirota, YMatsuoka, SNakai, HToda, MCheronis, JCSpruce, LWGyorkos, AWieczorek, M Design and synthesis of new orally active nonpeptidic inhibitors of human neutrophil elastase. J Med Chem43:4927-9 (2001) Neutrophil elastase
Name:Neutrophil elastase
Type:Enzyme
Mol. Mass.:28532.38
Organism:Homo sapiens (Human)
Description:P08246
Residue:267
BDBM50095518
NameBDBM50095518
Synonyms:(S)-N-[1-(5-tert-Butyl-[1,3,4]oxadiazole-2-carbonyl)-2-methyl-propyl]-2-[2-(4-fluoro-phenyl)-6-oxo-6H-pyrimidin-1-yl]-acetamidewith 0.7 moles of H20 N-[1-(5-tert-Butyl-[1,3,4]oxadiazole-2-carbonyl)-2-methyl-propyl]-2-[2-(4-fluoro-phenyl)-6-oxo-6H-pyrimidin-1-yl]-acetamide
TypeSmall organic molecule
Emp. Form.C23H26FN5O4
Mol. Mass.455.482
SMILESCC(C)[C@H](NC(=O)Cn1c(nccc1=O)-c1ccc(F)cc1)C(=O)c1nnc(o1)C(C)(C)C