Reaction Details
TargetMuscarinic acetylcholine receptor M1
LigandBDBM50095653
Substrate/Competitorn/a
Meas. Tech.ChEMBL_138399 (CHEMBL744762)
Ki 2.5±n/a nM
Citation Mitsuya, MKobayashi, KKawakami, KSatoh, AOgino, YKakikawa, TOhtake, NKimura, THirose, HSato, ANumazawa, THasegawa, TNoguchi, KMase, T A potent, long-acting, orally active (2R)-2-[(1R)-3, 3-difluorocyclopentyl]-2-hydroxy-2-phenylacetamide: novel muscarinic M(3) receptor antagonist with high selectivity for M(3) over M(2) receptors. J Med Chem43:5017-29 (2001) Muscarinic acetylcholine receptor M1
Name:Muscarinic acetylcholine receptor M1
Type:Protein
Mol. Mass.:51442.54
Organism:Homo sapiens (Human)
Description:P11229
Residue:460
BDBM50095653
NameBDBM50095653
Synonyms:2-(3,3-Difluoro-cyclopentyl)-N-[1-(3-fluoro-benzyl)-piperidin-4-yl]-2-hydroxy-2-phenyl-acetamide | CHEMBL147611
TypeSmall organic molecule
Emp. Form.C25H29F3N2O2
Mol. Mass.446.5052
SMILESO[C@@]([C@@H]1CCC(F)(F)C1)(C(=O)NC1CCN(Cc2cccc(F)c2)CC1)c1ccccc1