Reaction Details
TargetMuscarinic acetylcholine receptor M3
LigandBDBM50095675
Substrate/Competitorn/a
Meas. Tech.ChEMBL_138696 (CHEMBL747663)
Ki 3.5±n/a nM
Citation Mitsuya, MKobayashi, KKawakami, KSatoh, AOgino, YKakikawa, TOhtake, NKimura, THirose, HSato, ANumazawa, THasegawa, TNoguchi, KMase, T A potent, long-acting, orally active (2R)-2-[(1R)-3, 3-difluorocyclopentyl]-2-hydroxy-2-phenylacetamide: novel muscarinic M(3) receptor antagonist with high selectivity for M(3) over M(2) receptors. J Med Chem43:5017-29 (2001) Muscarinic acetylcholine receptor M3
Name:Muscarinic acetylcholine receptor M3
Type:Enzyme
Mol. Mass.:66151.03
Organism:Homo sapiens (Human)
Description:P20309
Residue:590
BDBM50095675
NameBDBM50095675
Synonyms:2-(3,3-Difluoro-cyclopentyl)-2-hydroxy-N-[1-(3-methoxy-benzyl)-piperidin-4-yl]-2-phenyl-acetamide | CHEMBL149484
TypeSmall organic molecule
Emp. Form.C26H32F2N2O3
Mol. Mass.458.5407
SMILESCOc1cccc(CN2CCC(CC2)NC(=O)[C@@](O)([C@@H]2CCC(F)(F)C2)c2ccccc2)c1