Reaction Details
TargetMuscarinic acetylcholine receptor M1
LigandBDBM50095671
Substrate/Competitorn/a
Meas. Tech.ChEMBL_138399 (CHEMBL744762)
Ki 5.3±n/a nM
Citation Mitsuya, MKobayashi, KKawakami, KSatoh, AOgino, YKakikawa, TOhtake, NKimura, THirose, HSato, ANumazawa, THasegawa, TNoguchi, KMase, T A potent, long-acting, orally active (2R)-2-[(1R)-3, 3-difluorocyclopentyl]-2-hydroxy-2-phenylacetamide: novel muscarinic M(3) receptor antagonist with high selectivity for M(3) over M(2) receptors. J Med Chem43:5017-29 (2001) Muscarinic acetylcholine receptor M1
Name:Muscarinic acetylcholine receptor M1
Type:Protein
Mol. Mass.:51442.54
Organism:Homo sapiens (Human)
Description:P11229
Residue:460
BDBM50095671
NameBDBM50095671
Synonyms:2-(3,3-Difluoro-cyclopentyl)-2-hydroxy-2-phenyl-N-(1-thiophen-3-ylmethyl-piperidin-4-yl)-acetamide | CHEMBL356505
TypeSmall organic molecule
Emp. Form.C23H28F2N2O2S
Mol. Mass.434.542
SMILESO[C@@]([C@@H]1CCC(F)(F)C1)(C(=O)NC1CCN(Cc2ccsc2)CC1)c1ccccc1