Reaction Details
TargetMuscarinic acetylcholine receptor M3
LigandBDBM50079714
Substrate/Competitorn/a
Meas. Tech.ChEMBL_138696 (CHEMBL747663)
Ki 4.2±n/a nM
Citation Mitsuya, MKobayashi, KKawakami, KSatoh, AOgino, YKakikawa, TOhtake, NKimura, THirose, HSato, ANumazawa, THasegawa, TNoguchi, KMase, T A potent, long-acting, orally active (2R)-2-[(1R)-3, 3-difluorocyclopentyl]-2-hydroxy-2-phenylacetamide: novel muscarinic M(3) receptor antagonist with high selectivity for M(3) over M(2) receptors. J Med Chem43:5017-29 (2001) Muscarinic acetylcholine receptor M3
Name:Muscarinic acetylcholine receptor M3
Type:Enzyme
Mol. Mass.:66151.03
Organism:Homo sapiens (Human)
Description:P20309
Residue:590
BDBM50079714
NameBDBM50079714
Synonyms:(R)-2-Cyclopentyl-2-hydroxy-N-[1-(4-methyl-pent-3-enyl)-piperidin-4-yl]-2-phenyl-acetamide CHEMBL59836
TypeSmall organic molecule
Emp. Form.C24H36N2O2
Mol. Mass.384.5548
SMILES[#6]\[#6](-[#6])=[#6]\[#6]-[#6]-[#7]-1-[#6]-[#6]-[#6](-[#6]-[#6]-1)-[#7]-[#6](=O)[C@@]([#8])([#6]-1-[#6]-[#6]-[#6]-[#6]-1)c1ccccc1