Reaction Details
TargetMuscarinic acetylcholine receptor M2
LigandBDBM50095657
Substrate/Competitorn/a
Meas. Tech.ChEMBL_139640 (CHEMBL748253)
Ki 530±n/a nM
Citation Mitsuya, MKobayashi, KKawakami, KSatoh, AOgino, YKakikawa, TOhtake, NKimura, THirose, HSato, ANumazawa, THasegawa, TNoguchi, KMase, T A potent, long-acting, orally active (2R)-2-[(1R)-3, 3-difluorocyclopentyl]-2-hydroxy-2-phenylacetamide: novel muscarinic M(3) receptor antagonist with high selectivity for M(3) over M(2) receptors. J Med Chem43:5017-29 (2001) Muscarinic acetylcholine receptor M2
Name:Muscarinic acetylcholine receptor M2
Type:GPCR
Mol. Mass.:51730.61
Organism:Homo sapiens (Human)
Description:P08172
Residue:466
BDBM50095657
NameBDBM50095657
Synonyms:(R)-N-[1-(6-Amino-pyridin-2-ylmethyl)-piperidin-4-yl]-2-((R)-3,3-difluoro-cyclopentyl)-2-hydroxy-2-phenyl-acetamide N-[1-(6-Amino-pyridin-2-ylmethyl)-piperidin-4-yl]-2-(3,3-difluoro-cyclopentyl)-2-hydroxy-2-phenyl-acetamide
TypeSmall organic molecule
Emp. Form.C24H30F2N4O2
Mol. Mass.444.5174
SMILESNc1cccc(CN2CCC(CC2)NC(=O)[C@@](O)([C@@H]2CCC(F)(F)C2)c2ccccc2)n1