Reaction Details
TargetMuscarinic acetylcholine receptor M1
LigandBDBM50095655
Substrate/Competitorn/a
Meas. Tech.ChEMBL_138399 (CHEMBL744762)
Ki 3.5±n/a nM
Citation Mitsuya, MKobayashi, KKawakami, KSatoh, AOgino, YKakikawa, TOhtake, NKimura, THirose, HSato, ANumazawa, THasegawa, TNoguchi, KMase, T A potent, long-acting, orally active (2R)-2-[(1R)-3, 3-difluorocyclopentyl]-2-hydroxy-2-phenylacetamide: novel muscarinic M(3) receptor antagonist with high selectivity for M(3) over M(2) receptors. J Med Chem43:5017-29 (2001) Muscarinic acetylcholine receptor M1
Name:Muscarinic acetylcholine receptor M1
Type:Protein
Mol. Mass.:51442.54
Organism:Homo sapiens (Human)
Description:P11229
Residue:460
BDBM50095655
NameBDBM50095655
Synonyms:CHEMBL343449 | N-[1-(4-Amino-benzyl)-piperidin-4-yl]-2-(3,3-difluoro-cyclopentyl)-2-hydroxy-2-phenyl-acetamide
TypeSmall organic molecule
Emp. Form.C25H31F2N3O2
Mol. Mass.443.5293
SMILESNc1ccc(CN2CCC(CC2)NC(=O)[C@@](O)([C@@H]2CCC(F)(F)C2)c2ccccc2)cc1