Reaction Details
TargetSigma non-opioid intracellular receptor 1
LigandBDBM50095706
Substrate/Competitorn/a
Meas. Tech.ChEMBL_201561 (CHEMBL804716)
Ki 1700±n/a nM
Citation May, ELJacobson, AEMattson, MVTraynor, JRWoods, JHHarris, LSBowman, ERAceto, MD Synthesis and in vitro and in vivo activity of (-)-(1R,5R,9R)- and (+)-(1S,5S,9S)-N-alkenyl-, -N-alkynyl-, and -N-cyanoalkyl-5, 9-dimethyl-2'-hydroxy-6,7-benzomorphan homologues. J Med Chem43:5030-6 (2001) Sigma non-opioid intracellular receptor 1
Name:Sigma non-opioid intracellular receptor 1
Type:Enzyme Catalytic Domain
Mol. Mass.:25246.51
Organism:Mus musculus (Mouse)
Description:O55242
Residue:223
BDBM50095706
NameBDBM50095706
Synonyms:4-(8-Hydroxy-6,11-dimethyl-1,2,5,6-tetrahydro-4H-2,6-methano-benzo[d]azocin-3-yl)-butyronitrile | CHEMBL149490
TypeSmall organic molecule
Emp. Form.C18H24N2O
Mol. Mass.284.396
SMILESC[C@H]1C2Cc3ccc(O)cc3[C@@]1(C)CCN2CCCC#N