Reaction Details
TargetKappa-type opioid receptor
LigandBDBM50095700
Substrate/Competitorn/a
Meas. Tech.ChEMBL_145566 (CHEMBL749570)
Ki 38±n/a nM
Citation May, ELJacobson, AEMattson, MVTraynor, JRWoods, JHHarris, LSBowman, ERAceto, MD Synthesis and in vitro and in vivo activity of (-)-(1R,5R,9R)- and (+)-(1S,5S,9S)-N-alkenyl-, -N-alkynyl-, and -N-cyanoalkyl-5, 9-dimethyl-2'-hydroxy-6,7-benzomorphan homologues. J Med Chem43:5030-6 (2001) Kappa-type opioid receptor
Name:Kappa-type opioid receptor
Type:Enzyme
Mol. Mass.:42656.78
Organism:Mus musculus (Mouse)
Description:P33534
Residue:380
BDBM50095700
NameBDBM50095700
Synonyms:7-(8-Hydroxy-6,11-dimethyl-1,2,5,6-tetrahydro-4H-2,6-methano-benzo[d]azocin-3-yl)-heptanenitrile | CHEMBL423565
TypeSmall organic molecule
Emp. Form.C21H30N2O
Mol. Mass.326.4757
SMILESC[C@H]1C2Cc3ccc(O)cc3[C@@]1(C)CCN2CCCCCCC#N