Reaction Details
TargetSigma non-opioid intracellular receptor 1
LigandBDBM50095717
Substrate/Competitorn/a
Meas. Tech.ChEMBL_201571 (CHEMBL872706)
Ki 11000±n/a nM
Citation May, ELJacobson, AEMattson, MVTraynor, JRWoods, JHHarris, LSBowman, ERAceto, MD Synthesis and in vitro and in vivo activity of (-)-(1R,5R,9R)- and (+)-(1S,5S,9S)-N-alkenyl-, -N-alkynyl-, and -N-cyanoalkyl-5, 9-dimethyl-2'-hydroxy-6,7-benzomorphan homologues. J Med Chem43:5030-6 (2001) Sigma non-opioid intracellular receptor 1
Name:Sigma non-opioid intracellular receptor 1
Type:Enzyme Catalytic Domain
Mol. Mass.:25266.54
Organism:RAT
Description:Q9R0C9
Residue:223
BDBM50095717
NameBDBM50095717
Synonyms:(8-Hydroxy-6,11-dimethyl-1,2,5,6-tetrahydro-4H-2,6-methano-benzo[d]azocin-3-yl)-acetonitrile | CHEMBL146574
TypeSmall organic molecule
Emp. Form.C16H20N2O
Mol. Mass.256.3428
SMILESCC1C2Cc3ccc(O)cc3[C@@]1(C)CCN2CC#N