Reaction Details
TargetSigma non-opioid intracellular receptor 1
LigandBDBM50095699
Substrate/Competitorn/a
Meas. Tech.ChEMBL_201571 (CHEMBL872706)
Ki 1.1±n/a nM
Citation May, ELJacobson, AEMattson, MVTraynor, JRWoods, JHHarris, LSBowman, ERAceto, MD Synthesis and in vitro and in vivo activity of (-)-(1R,5R,9R)- and (+)-(1S,5S,9S)-N-alkenyl-, -N-alkynyl-, and -N-cyanoalkyl-5, 9-dimethyl-2'-hydroxy-6,7-benzomorphan homologues. J Med Chem43:5030-6 (2001) Sigma non-opioid intracellular receptor 1
Name:Sigma non-opioid intracellular receptor 1
Type:Enzyme Catalytic Domain
Mol. Mass.:25266.54
Organism:RAT
Description:Q9R0C9
Residue:223
BDBM50095699
NameBDBM50095699
Synonyms:3-Hex-5-enyl-6,11-dimethyl-1,2,3,4,5,6-hexahydro-2,6-methano-benzo[d]azocin-8-ol | CHEMBL146248
TypeSmall organic molecule
Emp. Form.C20H29NO
Mol. Mass.299.4504
SMILESCC1C2Cc3ccc(O)cc3[C@@]1(C)CCN2CCCCC=C