Reaction Details
TargetMu-type opioid receptor
LigandBDBM50095712
Substrate/Competitorn/a
Meas. Tech.ChEMBL_148518 (CHEMBL758128)
Ki 15±n/a nM
Citation May, ELJacobson, AEMattson, MVTraynor, JRWoods, JHHarris, LSBowman, ERAceto, MD Synthesis and in vitro and in vivo activity of (-)-(1R,5R,9R)- and (+)-(1S,5S,9S)-N-alkenyl-, -N-alkynyl-, and -N-cyanoalkyl-5, 9-dimethyl-2'-hydroxy-6,7-benzomorphan homologues. J Med Chem43:5030-6 (2001) Mu-type opioid receptor
Name:Mu-type opioid receptor
Type:Enzyme Catalytic Domain
Mol. Mass.:44431.62
Organism:MOUSE
Description:OPIATE Mu OPRM1 MOUSE::P42866
Residue:398
BDBM50095712
NameBDBM50095712
Synonyms:6,11-Dimethyl-3-pent-4-enyl-1,2,3,4,5,6-hexahydro-2,6-methano-benzo[d]azocin-8-ol | CHEMBL146030
TypeSmall organic molecule
Emp. Form.C19H27NO
Mol. Mass.285.4238
SMILESC[C@H]1C2Cc3ccc(O)cc3[C@@]1(C)CCN2CCCC=C