Reaction Details
TargetDelta-type opioid receptor
LigandBDBM50095732
Substrate/Competitorn/a
Meas. Tech.ChEMBL_146037 (CHEMBL754944)
IC50 5.4±n/a nM
Citation Maeda, DYBerman, FMurray, TFAldrich, JV Synthesis and evaluation of isothiocyanate-containing derivatives of the delta-opioid receptor antagonist Tyr-Tic-Phe-Phe (TIPP) as potential affinity labels for delta-opioid receptors. J Med Chem43:5044-9 (2001) Delta-type opioid receptor
Name:Delta-type opioid receptor
Type:Enzyme Catalytic Domain
Mol. Mass.:40577.25
Organism:MOUSE
Description:P32300
Residue:372
BDBM50095732
NameBDBM50095732
Synonyms:2-[2-({2-[2-Amino-3-(4-hydroxy-phenyl)-propionyl]-1,2,3,4-tetrahydro-isoquinoline-3-carbonyl}-amino)-3-phenyl-propionylamino]-3-(4-isothiocyanato-phenyl)-propionic acid | CHEMBL149788
TypeSmall organic molecule
Emp. Form.C38H37N5O6S
Mol. Mass.691.795
SMILESNC(Cc1ccc(O)cc1)C(=O)N1Cc2ccccc2C[C@H]1C(=O)N[C@@H](Cc1ccccc1)C(=O)N[C@@H](Cc1ccc(cc1)N=C=S)C(O)=O