Reaction Details
TargetReverse transcriptase/RNaseH
LigandBDBM50008310
Substrate/Competitorn/a
Meas. Tech.ChEMBL_197277 (CHEMBL804264)
EC50 13±n/a nM
Citation Rizzo, RCTirado-Rives, JJorgensen, WL Estimation of binding affinities for HEPT and nevirapine analogues with HIV-1 reverse transcriptase via Monte Carlo simulations. J Med Chem44:145-54 (2001) Reverse transcriptase/RNaseH
Name:Reverse transcriptase/RNaseH
Type:PROTEIN
Mol. Mass.:65229.15
Organism:Human immunodeficiency virus 1
Description:ChEMBL_1473730
Residue:566
BDBM50008310
NameBDBM50008310
Synonyms:6-(3,5-Dimethyl-phenylsulfanyl)-5-ethyl-1-(2-hydroxy-ethoxymethyl)-1H-pyrimidine-2,4-dione | CHEMBL16684
TypeSmall organic molecule
Emp. Form.C17H22N2O4S
Mol. Mass.350.433
SMILESCCc1c(Sc2cc(C)cc(C)c2)n(COCCO)c(=O)[nH]c1=O