Reaction Details
TargetReverse transcriptase/RNaseH
LigandBDBM50095770
Substrate/Competitorn/a
Meas. Tech.ChEMBL_195341 (CHEMBL802583)
IC50 15300±n/a nM
Citation Rizzo, RCTirado-Rives, JJorgensen, WL Estimation of binding affinities for HEPT and nevirapine analogues with HIV-1 reverse transcriptase via Monte Carlo simulations. J Med Chem44:145-54 (2001) Reverse transcriptase/RNaseH
Name:Reverse transcriptase/RNaseH
Type:PROTEIN
Mol. Mass.:65229.15
Organism:Human immunodeficiency virus 1
Description:ChEMBL_1473730
Residue:566
BDBM50095770
NameBDBM50095770
Synonyms:5-Acetyl-10-methyl-5,10-dihydro-4,5,6,10-tetraaza-dibenzo[a,d]cyclohepten-11-one | CHEMBL290781
TypeSmall organic molecule
Emp. Form.C14H12N4O2
Mol. Mass.268.2707
SMILESCN1c2cccnc2N(C(C)=O)c2ncccc2C1=O