Reaction Details
TargetReverse transcriptase/RNaseH
LigandBDBM50004126
Substrate/Competitorn/a
Meas. Tech.ChEMBL_197277 (CHEMBL804264)
EC50 100±n/a nM
Citation Rizzo, RCTirado-Rives, JJorgensen, WL Estimation of binding affinities for HEPT and nevirapine analogues with HIV-1 reverse transcriptase via Monte Carlo simulations. J Med Chem44:145-54 (2001) Reverse transcriptase/RNaseH
Name:Reverse transcriptase/RNaseH
Type:PROTEIN
Mol. Mass.:65229.15
Organism:Human immunodeficiency virus 1
Description:ChEMBL_1473730
Residue:566
BDBM50004126
NameBDBM50004126
Synonyms:5-Cyclopropyl-1-ethoxymethyl-6-phenylsulfanyl-1H-pyrimidine-2,4-dione | CHEMBL39093
TypeSmall organic molecule
Emp. Form.C16H18N2O3S
Mol. Mass.318.391
SMILESCCOCn1c(Sc2ccccc2)c(C2CC2)c(=O)[nH]c1=O