Reaction Details
TargetReverse transcriptase/RNaseH
LigandBDBM50004140
Substrate/Competitorn/a
Meas. Tech.ChEMBL_197277 (CHEMBL804264)
EC50>250000±n/a nM
Citation Rizzo, RCTirado-Rives, JJorgensen, WL Estimation of binding affinities for HEPT and nevirapine analogues with HIV-1 reverse transcriptase via Monte Carlo simulations. J Med Chem44:145-54 (2001) Reverse transcriptase/RNaseH
Name:Reverse transcriptase/RNaseH
Type:PROTEIN
Mol. Mass.:65229.15
Organism:Human immunodeficiency virus 1
Description:ChEMBL_1473730
Residue:566
BDBM50004140
NameBDBM50004140
Synonyms:5-Methyl-6-phenylsulfanyl-1H-pyrimidine-2,4-dione | CHEMBL290413
TypeSmall organic molecule
Emp. Form.C11H10N2O2S
Mol. Mass.234.274
SMILESCc1c(Sc2ccccc2)[nH]c(=O)[nH]c1=O