Reaction Details
TargetReverse transcriptase/RNaseH
LigandBDBM50010998
Substrate/Competitorn/a
Meas. Tech.ChEMBL_197277 (CHEMBL804264)
EC50 85000±n/a nM
Citation Rizzo, RCTirado-Rives, JJorgensen, WL Estimation of binding affinities for HEPT and nevirapine analogues with HIV-1 reverse transcriptase via Monte Carlo simulations. J Med Chem44:145-54 (2001) Reverse transcriptase/RNaseH
Name:Reverse transcriptase/RNaseH
Type:PROTEIN
Mol. Mass.:65229.15
Organism:Human immunodeficiency virus 1
Description:ChEMBL_1473730
Residue:566
BDBM50010998
NameBDBM50010998
Synonyms:1-(2-Hydroxy-ethoxymethyl)-5-methyl-6-phenoxy-1H-pyrimidine-2,4-dione | CHEMBL286769
TypeSmall organic molecule
Emp. Form.C14H16N2O5
Mol. Mass.292.2872
SMILESCc1c(Oc2ccccc2)n(COCCO)c(=O)[nH]c1=O