Reaction Details
TargetReverse transcriptase/RNaseH
LigandBDBM1666
Substrate/Competitorn/a
Meas. Tech.ChEMBL_195341 (CHEMBL802583)
IC50 95±n/a nM
Citation Rizzo, RCTirado-Rives, JJorgensen, WL Estimation of binding affinities for HEPT and nevirapine analogues with HIV-1 reverse transcriptase via Monte Carlo simulations. J Med Chem44:145-54 (2001) Reverse transcriptase/RNaseH
Name:Reverse transcriptase/RNaseH
Type:PROTEIN
Mol. Mass.:65229.15
Organism:Human immunodeficiency virus 1
Description:ChEMBL_1473730
Residue:566
BDBM1666
NameBDBM1666
Synonyms:7-chloro-2-ethyl-2,4,9,15-tetraazatricyclo[9.4.0.0^{3,8}]pentadeca-1(11),3(8),4,6,12,14-hexaen-10-one Dipyridodiazepinone deriv. 98
TypeSmall organic molecule
Emp. Form.C13H11ClN4O
Mol. Mass.274.706
SMILESCCN1c2nccc(Cl)c2NC(=O)c2cccnc12