Reaction Details
TargetReverse transcriptase/RNaseH
LigandBDBM1652
Substrate/Competitorn/a
Meas. Tech.ChEMBL_195341 (CHEMBL802583)
IC50 450±n/a nM
Citation Rizzo, RCTirado-Rives, JJorgensen, WL Estimation of binding affinities for HEPT and nevirapine analogues with HIV-1 reverse transcriptase via Monte Carlo simulations. J Med Chem44:145-54 (2001) Reverse transcriptase/RNaseH
Name:Reverse transcriptase/RNaseH
Type:PROTEIN
Mol. Mass.:65229.15
Organism:Human immunodeficiency virus 1
Description:ChEMBL_1473730
Residue:566
BDBM1652
NameBDBM1652
Synonyms:2-cyclopropyl-2,4,9,15-tetraazatricyclo[9.4.0.0^{3,8}]pentadeca-1(11),3(8),4,6,12,14-hexaen-10-one | Dipyridodiazepinone deriv. 71
TypeSmall organic molecule
Emp. Form.C14H12N4O
Mol. Mass.252.2713
SMILESO=C1Nc2cccnc2N(C2CC2)c2ncccc12