Reaction Details
TargetAdenosine receptor A3
LigandBDBM50006710
Substrate/Competitorn/a
Meas. Tech.ChEMBL_31853 (CHEMBL643930)
Ki 2500±n/a nM
Citation Harada, HAsano, OHoshino, YYoshikawa, SMatsukura, MKabasawa, YNiijima, JKotake, YWatanabe, NKawata, TInoue, THorizoe, TYasuda, NMinami, HNagata, KMurakami, MNagaoka, JKobayashi, STanaka, IAbe, S 2-Alkynyl-8-aryl-9-methyladenines as novel adenosine receptor antagonists: their synthesis and structure-activity relationships toward hepatic glucose production induced via agonism of the A(2B) receptor. J Med Chem44:170-9 (2001) Adenosine receptor A3
Name:Adenosine receptor A3
Type:G Protein-Coupled Receptor (GPCR)
Mol. Mass.:36197.32
Organism:Homo sapiens (Human)
Description:P0DMS8
Residue:318
BDBM50006710
NameBDBM50006710
Synonyms:8-[(E)-2-(3,4-Dimethoxy-phenyl)-vinyl]-7-methyl-1,3-dipropyl-3,7-dihydro-purine-2,6-dione 8-[2-(3,4-Dimethoxy-phenyl)-vinyl]-7-methyl-1,3-dipropyl-3,7-dihydro-purine-2,6-dione; compound with 8-[2-(3,4-dimethoxy-phenyl)-vinyl]-7-methyl-1,3-dipropyl-3,7-dihydro-purine-2,6-dione CHEMBL27508 | KF-17837
TypeSmall organic molecule
Emp. Form.C22H28N4O4
Mol. Mass.412.4821
SMILESCCCn1c2nc(\C=C\c3ccc(OC)c(OC)c3)n(C)c2c(=O)n(CCC)c1=O